{"text_format":"1","workbook":"xlsx","n_sheets":13,"sheets":["Instructions","Invoice Template","Invoice Details","Background","Submitting Invoices","Contact Us","Sheet2","Sites","utilization report sample","bulk inv upload"," Shift Table ","AFter Hour Rates","Physician Reporting Periods"],"not_rendered":{"charts":0,"images":3,"macros":1,"external_links":0,"defined_names":10,"comments":0,"pivot_tables":0},"unopened":[],"bounds":{"document_bytes":16777216,"sheet_cells":100000,"rows_first":2000,"rows_last":500,"rows_between":2000,"halvings":0,"cell_chars":16384,"cell_head_chars":4096},"cells_cut":0,"cells_raw":0,"read":"whole","date_system":"1900"}

{"sheet":"Instructions","index":0,"n_rows":76,"n_cols":1,"rows_kept":76,"cut":false,"hidden":false,"merged":[]}
["APSA Hours Reporting After Hours Premium Invoice\n\nInstructions"]
[]
["Due to time constraints to meet new PMA requirements, this excel-based reporting and invoice template will be used to report"]
["hours until such time that a more sophisticated tool and system can be developed."]
["We appreciate your collaboration and cooperation as we implement this change."]
[]
["PLEASE NOTE: For providers and groups already submitting invoices and hours reporting, this is not intended to"]
["change your current workflow; however, you must use this new form for submission."]
[]
["Please regulary check the Medical Staff Website to ensure you are using the most up to date version of the template."]
{"$rows_left_out":67}
{"sheet":"Invoice Template","index":1,"n_rows":100,"n_cols":48,"rows_kept":100,"cut":false,"hidden":false,"merged":[[7,7,7,9],[9,12,9,15],[8,12,8,14],[7,12,7,14],[5,12,5,15],[3,12,3,15],[6,12,6,15],[4,12,4,15],[7,10,7,11],[10,12,10,14]]}
[null,null,null,null,null,null,null,null,null,null,null,null,null,null,null,null,null,null,null,null,0,0]
[null,null,null,null,null,null,null,null,"HOURS SUBMISSION AND AFTER HOURS INVOICE"]
[null,null,null,null,null,null,null,null,null,null,null,null,null,null,null,null,null,null,null,null,null,null,null,null,null,null,null,null,null,null,null,null,null,null,null,null,null,null,null,null,null,null,null,null,null,null,null,"remove macro from logo"]
[null,null,null,null,null,null,"Contract/ Program Name",null,null,null,null,"Contract #:"]
[null,null,null,null,null,null,"Provider Name/GROUP:",null,null,null,null,"Site/ Facility (from drop down list)",null,null,null,null,null,null,null,null,null,null,null,null,null,null,null,null,null,null,null,null,null,null,null,null,null,null,null,null,"Need Assistance? Contact:"]
[null,null,null,null,null,null,"Provider MSP#",null,null,null,null,"Site/ Facility (if not in drop down list)",null,null,null,null,null,null,null,null,null,null,null,null,null,null,null,null,null,null,null,null,null,null,null,null,null,null,null,null,"Physician_Comp@islandhealth.ca"]
[null,null,null,null,null,null,null,null,null,null,null,"Report Period: ",null,null,null,null,null,null,null,null,null,null,null,null,null,null,null,null,null,null,null,null,null,null,null,null,null,null,null,null,null,null,"V1.0"]
[null,null,null,null,"Physician/ Group \nValidation (Drop Down)",null,null,"I certify that this invoice is for actual hours worked as documented (consistent with the terms of the contract)",null,null,"Certification Authority (CA) Approval (enter name):",null,null,null,null,null,null,null,null,null,null,null,null,null,null,null,null,null,null,null,null,null,null,null,null,null,null,null,null,null,"Using Island Health email, forward invoice to Certification Authority (CA)"]
[null,null,null,null,null,null,"Date:",null,null,null,null,"Date:"]
[null,null,null,null,null,null,null,null,null,null,null,null,"I confirm to the best of my knowledge that the hours were worked \n(consistent with the terms of the contract)",null,null,null,null,null,null,null,null,null,null,null,null,null,null,null,null,null,null,null,null,null,null,null,null,null,null,null,"Once Approved by CA forward to:"]
{"$rows_left_out":91}
{"sheet":"Invoice Details","index":2,"n_rows":144,"n_cols":2,"rows_kept":144,"cut":false,"hidden":false,"merged":[[0,0,0,11]]}
["Invoice Field Details"]
[]
["Contract/ Program"]
["Indicate the program for which you are submitting an invoice."]
["If you have more than 1 contract that requires invoice submission, you must submit a separate invoice for each."]
[]
["Provider Name/ Group:"]
["For Individual Providers: Enter Your Name as Last name, First name"]
["For Groups: Type \"Group\" (ensuring correct spelling)"]
["Please submit all physician hours for the group on the same invoice."]
{"$rows_left_out":135}
{"sheet":"Background","index":3,"n_rows":30,"n_cols":1,"rows_kept":30,"cut":false,"hidden":false,"merged":[]}
["Background"]
["Effective April 1, 2023, the recently negotiated and ratified 2022 Physician Master Agreement (PMA) between the Doctors of BC and the Ministry of Health created new hourly reporting obligations for physicians providing services under Alternative Payment Subsidiary Agreement (APSA) service contracts and established After Hours Premium (AHP) payments for physicians providing services under APSA service contracts. Reporting requirements and premium eligibility information are detailed below."]
[]
["APSA Service Contract Hours Reporting"]
["Under the 2022 PMA, physicians working under APSA service contracts must report hours spent providing services with the following information:"]
["·        Date of service;"]
["·        Location of service, identified as “on-site” or “off-site”;"]
["·        For scheduled services, start and stop times rounded to the nearest 15 minute increment. Where scheduled services are provided more than 30 minutes apart within the same day, separate daily entries are required; and,"]
["·        For unscheduled services, total hours rounded to the nearest 15 minute increment."]
["Please note that we will still require each daily hour reporting entry be separated into Direct, Indirect, and Non-Patient care hours. "]
{"$rows_left_out":21}
{"sheet":"Submitting Invoices","index":4,"n_rows":13,"n_cols":1,"rows_kept":13,"cut":false,"hidden":false,"merged":[]}
["Forwarding Instructions"]
[]
["Sending the Invoice:"]
["Only send/transfer this invoice using an Island Health email account. Sending via a non-Island "]
["Health email address will result in the file not being received."]
[]
["If you, or the person submitting invoices on your behalf, do not have access to an Island Health "]
["email account, please contact:"]
["Physician_Comp@Islandhealth.ca"]
[]
{"$rows_left_out":4}
{"sheet":"Contact Us","index":5,"n_rows":5,"n_cols":1,"rows_kept":5,"cut":false,"hidden":false,"merged":[[0,0,0,12]]}
["Contact Us"]
[]
["Any questions/ concerns? Contact:"]
[]
["Physician_Comp@islandhealth.ca"]

{"sheet":"Sheet2","index":6,"n_rows":42,"n_cols":11,"rows_kept":42,"cut":false,"hidden":true,"merged":[]}
["Date","Date = Cells.Find(What:=\"Date\", LookIn:=xlFormulas).column",{"$f":"\"Dim \"&A1&\" as Long\"","v":"Dim Date as Long"},"=","Columns(",{"$f":"+A1","v":"Date"},").Hidden = True",null,null,{"$f":"CONCATENATE(D1,E1,F1,G1)","v":"=Columns(Date).Hidden = True"},13]
["Contract","Contract = Cells.Find(What:=\"Contract*#\", LookIn:=xlFormulas).column",{"$f":"\"Dim \"&A2&\" as Long\"","v":"Dim Contract as Long"},"=","cells.find(what:=\"",{"$f":"+A2","v":"Contract"},"\", LookIn:=xlFormulas).Row",null,null,{"$f":"CONCATENATE(A2,D2,E2,F2,G2)","v":"Contract=cells.find(what:=\"Contract\", LookIn:=xlFormulas).Row"},14]
["dayorend","dayorend = Cells.Find(What:=\"Weekday*or*Weekend\", LookIn:=xlFormulas).column","Dim dayorend as Long","=","cells.find(what:=\"",{"$f":"+A3","v":"dayorend"},"\", LookIn:=xlFormulas).Row",null,null,"dayorend=cells.find(what:=\"dayorend\", LookIn:=xlFormulas).Row",15]
["Stat_Lieu","Stat_Lieu = Cells.Find(What:=\"Stat/Lieu*\", LookIn:=xlFormulas).column","Dim Stat_Lieu as Long","=","cells.find(what:=\"","Stat_Lieu","\", LookIn:=xlFormulas).Row",null,null,"Stat_Lieu=cells.find(what:=\"Stat_Lieu\", LookIn:=xlFormulas).Row",17]
["Shift","Shift = Cells.Find(What:=\"*Scheduled*Unscheduled*\", LookIn:=xlFormulas).column","Dim Shift as Long","=","cells.find(what:=\"","Shift","\", LookIn:=xlFormulas).Row",null,null,"Shift=cells.find(what:=\"Shift\", LookIn:=xlFormulas).Row",18]
["ON_OFF_Site","ON_OFF_Site = Cells.Find(What:=\"ON*OFF*SITE*\", LookIn:=xlFormulas).column","Dim ON_OFF_Site as Long","=","cells.find(what:=\"","ON_OFF_Site","\", LookIn:=xlFormulas).Row",null,null,"ON_OFF_Site=cells.find(what:=\"ON_OFF_Site\", LookIn:=xlFormulas).Row",19]
["Site","Site = Cells.Find(What:=\"Site\", LookIn:=xlFormulas).column","Dim Site as Long","=","cells.find(what:=\"","Site","\", LookIn:=xlFormulas).Row",null,null,"Site=cells.find(what:=\"Site\", LookIn:=xlFormulas).Row",20]
["Shift_Start_Time","Shift_Start_Time = Cells.Find(What:=\"Shift*Start*Time*\", LookIn:=xlFormulas).column","Dim Shift_Start_Time as Long","=","cells.find(what:=\"","Shift_Start_Time","\", LookIn:=xlFormulas).Row",null,null,"Shift_Start_Time=cells.find(what:=\"Shift_Start_Time\", LookIn:=xlFormulas).Row",21]
["Shift_End_Time","Shift_End_Time = Cells.Find(What:=\"Shift*End*Time*\", LookIn:=xlFormulas).column","Dim Shift_End_Time as Long","=","cells.find(what:=\"","Shift_End_Time","\", LookIn:=xlFormulas).Row",null,null,"Shift_End_Time=cells.find(what:=\"Shift_End_Time\", LookIn:=xlFormulas).Row",22]
["Total_Shift_Hours","Total_Shift_Hours = Cells.Find(What:=\"Total*Hours\", LookIn:=xlFormulas).column","Dim Total_Shift_Hours as Long","=","cells.find(what:=\"","Total_Shift_Hours","\", LookIn:=xlFormulas).Row",null,null,"Total_Shift_Hours=cells.find(what:=\"Total_Shift_Hours\", LookIn:=xlFormulas).Row",23]
{"$rows_left_out":33}
{"sheet":"Sites","index":7,"n_rows":211,"n_cols":2,"rows_kept":211,"cut":false,"hidden":true,"merged":[]}
["Name","Code"]
["Not on List"]
["Multi"]
["Allergy Victoria","Y0986"]
["Arbutus Family Medicine","Y1085"]
["Arrowsmith Lodge","Y0300"]
["Ayre Manor Assisted Living","Y0172"]
["Bamfield Health Centre","Z8550"]
["Beacon Hill Villa","Y0173"]
["Beaufort Clinic","Y0301"]
{"$rows_left_out":202}
{"sheet":"utilization report sample","index":8,"n_rows":16,"n_cols":18,"rows_kept":16,"cut":false,"hidden":true,"merged":[]}
["CPRP_ID","HA_RECORD_ID","PRAC_BILLING_NUMBER","PRAC_NAME","PAYEE_NUMBER","ACTUAL_PRACTICE_CATEGORY","ACTUAL_RANGE_PLACEMENT","ACTUAL_RATE_PAID","RRP_SCC","RRP_PAID","SERVICE_START_DATE","SERVICE_END_DATE","SERVICE_START_TIME","SERVICE_END_TIME","SERVICE_TYPE","HOURS","ACTUAL_FACILITY","APP_AMT"]
[22198,1,65392,"Atherstone, Michael",36597,"ANAESN",100,394.77,"CC",27.36,"2022-08-19","2022-08-19","07:00:00","08:00:00","OR",1,"Z5030",394.77]
[22198,2,65392,"Atherstone, Michael",36597,"ANAESD",100,225.18,"CC",7.8,"2022-08-19","2022-08-19","08:00:00","08:30:00","OOR",0.5,"Z5030",225.18]
[22198,3,44352,"Briggs, Joshua",36597,"ANAESN",100,394.77,"CC",20.52,"2022-08-19","2022-08-19","07:15:00","08:00:00","OR",0.75,"Z5030",394.77]
[22198,4,44352,"Briggs, Joshua",36597,"ANAESD",100,225.18,"CC",117.04,"2022-08-19","2022-08-19","08:00:00","15:30:00","OR",7.5,"Z5030",225.18]
[22198,5,44352,"Briggs, Joshua",36597,"ANAESD",100,225.18,"CC",15.6,"2022-08-19","2022-08-19","15:30:00","16:30:00","Overrun",1,"Z5030",225.18]
[22198,6,1592,"Collins, Ronald",36597,"ANAESN",100,394.77,"CC",20.52,"2022-08-19","2022-08-19","07:15:00","08:00:00","OR",0.75,"Z5030",394.77]
[22198,7,1592,"Collins, Ronald",36597,"ANAESD",100,225.18,"CC",117.04,"2022-08-19","2022-08-19","08:00:00","15:30:00","OR",7.5,"Z5030",225.18]
[22198,8,1592,"Collins, Ronald",36597,"ANAESD",100,225.18,"CC",11.7,"2022-08-19","2022-08-19","15:30:00","16:15:00","Overrun",0.75,"Z5030",225.18]
[22198,9,65392,"Atherstone, Michael",36597,"ANAESD",100,225.18,"CC",46.81,"2022-08-19","2022-08-19","15:00:00","18:00:00","OR",3,"Z5030",225.18]
{"$rows_left_out":7}
{"sheet":"bulk inv upload","index":9,"n_rows":32,"n_cols":14,"rows_kept":32,"cut":false,"hidden":true,"merged":[]}
[]
[]
["Physician Name","MSP #","Vendor","Type","EffectiveDate(yyyy/mm/dd)","InvoiceDate\n(yyyy/mm/dd)","InvoiceNumber","Description","GlAccount","Amount","Tax","StatHours","Approver",{"$f":"SUM(J:J)","v":0}]
["Atherstone, Michael",65392,"R016047",{"$f":"\"FEE\"","v":"FEE"},{"$f":"TODAY()","v":"2023-03-30"},{"$f":"VLOOKUP('Invoice Template'!#REF!,'Physician Reporting Periods'!A:C,3,0)","v":{"$error":"#REF!"}},{"$f":"TEXT(F4,\"yymmdd\")&\"NIHAN\"","v":{"$error":"#REF!"}},{"$f":"'Invoice Template'!M4&\" \"&TEXT(F4,\"mmm d yy\")","v":{"$error":"#REF!"}},null,{"$f":"ROUND(SUMIFS('Invoice Template'!$AP$13:$AP$99,'Invoice Template'!$A$13:$A$99,'bulk inv upload'!$A4),2)","v":0},"NON",{"$f":"0","v":0},"YG"]
["Badh, Charanjit",67499,"R032217","FEE",{"$f":"+$E$4","v":"2023-03-30"},{"$f":"VLOOKUP('Invoice Template'!#REF!,'Physician Reporting Periods'!A:C,3,0)","v":{"$error":"#REF!"}},{"$error":"#REF!"},{"$f":"+H$4","v":{"$error":"#REF!"}},null,{"$f":"ROUND(SUMIFS('Invoice Template'!$AP$13:$AP$99,'Invoice Template'!$A$13:$A$99,'bulk inv upload'!$A27),2)","v":0},{"$f":"+K$4","v":"NON"},{"$f":"0","v":0},{"$f":"+$M$4","v":"YG"}]
["Becotte, Annick",39452,"R031513","FEE","2023-03-30",{"$f":"VLOOKUP('Invoice Template'!G108,'Physician Reporting Periods'!A:C,3,0)","v":{"$error":"#N/A"}},{"$error":"#N/A"},{"$error":"#REF!"},null,{"$f":"ROUND(SUMIFS('Invoice Template'!$AP$13:$AP$99,'Invoice Template'!$A$13:$A$99,'bulk inv upload'!$A24),2)","v":0},"NON",{"$f":"0","v":0},"YG"]
["Blais, Alexandre",67060,"R020389","FEE","2023-03-30",{"$f":"VLOOKUP('Invoice Template'!#REF!,'Physician Reporting Periods'!A:C,3,0)","v":{"$error":"#REF!"}},{"$error":"#REF!"},{"$error":"#REF!"},null,{"$f":"ROUND(SUMIFS('Invoice Template'!$AP$13:$AP$99,'Invoice Template'!$A$13:$A$99,'bulk inv upload'!#REF!),2)","v":0},"NON",{"$f":"0","v":0},"YG"]
["Briggs, Joshua",44352,"R032204","FEE","2023-03-30",{"$f":"VLOOKUP('Invoice Template'!#REF!,'Physician Reporting Periods'!A:C,3,0)","v":{"$error":"#REF!"}},{"$error":"#REF!"},{"$error":"#REF!"},null,{"$f":"ROUND(SUMIFS('Invoice Template'!$AP$13:$AP$99,'Invoice Template'!$A$13:$A$99,'bulk inv upload'!$A28),2)","v":0},"NON",{"$f":"0","v":0},"YG"]
["Chadwick, Mairi",36804,"R030918","FEE","2023-03-30",{"$f":"VLOOKUP('Invoice Template'!#REF!,'Physician Reporting Periods'!A:C,3,0)","v":{"$error":"#REF!"}},{"$error":"#REF!"},{"$error":"#REF!"},null,{"$f":"ROUND(SUMIFS('Invoice Template'!$AP$13:$AP$99,'Invoice Template'!$A$13:$A$99,'bulk inv upload'!$A8),2)","v":0},"NON",{"$f":"0","v":0},"YG"]
["Collins, Ronald",1592,"R031912","FEE","2023-03-30",{"$f":"VLOOKUP('Invoice Template'!G120,'Physician Reporting Periods'!A:C,3,0)","v":{"$error":"#N/A"}},{"$error":"#N/A"},{"$error":"#REF!"},null,{"$f":"ROUND(SUMIFS('Invoice Template'!$AP$13:$AP$99,'Invoice Template'!$A$13:$A$99,'bulk inv upload'!$A25),2)","v":0},"NON",{"$f":"0","v":0},"YG"]
{"$rows_left_out":23}
{"sheet":" Shift Table ","index":10,"n_rows":4,"n_cols":2,"rows_kept":4,"cut":false,"hidden":true,"merged":[]}
[]
[null,"CVH_SHIFTS"]
[null,"SCHEDULED "]
[null,"UNSCHEDULED"]

{"sheet":"AFter Hour Rates","index":11,"n_rows":19,"n_cols":3,"rows_kept":19,"cut":false,"hidden":true,"merged":[]}
["APPENDIX 2"]
[]
["PAYMENT"]
[]
["A.    Payment for Services"]
[]
["1.     Scheduled Shifts"]
[]
["Payment for Scheduled Shifts at RCH will be paid at the following hourly rates:"]
[]
{"$rows_left_out":10}
{"sheet":"Physician Reporting Periods","index":12,"n_rows":17,"n_cols":9,"rows_kept":17,"cut":false,"hidden":true,"merged":[]}
["Report Period","Start Date","End Date",null,"Statutory Holiday","Date"]
[{"$f":"TEXT(B2,\"MMM-D-yyyy\")&\" - \"&TEXT(C2,\"MMM-D-yyyy\")","v":"Mar-1-2023 - Mar-31-2023"},"2023-03-01",{"$f":"EOMONTH(DatesTable[[#This Row],[Start Date]],0)","v":"2023-03-31"},null,"Good Friday","2023-04-07",null,"2023-04-07",{"$f":"+H2='Invoice Template'!E15","v":false}]
["Apr-1-2023 - Apr-30-2023",{"$f":"+C2+1","v":"2023-04-01"},{"$f":"EOMONTH(DatesTable[[#This Row],[Start Date]],0)","v":"2023-04-30"},null,"Easter Monday","2023-04-10"]
["May-1-2023 - May-31-2023",{"$f":"+C3+1","v":"2023-05-01"},{"$f":"EOMONTH(DatesTable[[#This Row],[Start Date]],0)","v":"2023-05-31"},null,"Victoria Day","2023-05-22"]
["Jun-1-2023 - Jun-30-2023",{"$f":"+C4+1","v":"2023-06-01"},{"$f":"EOMONTH(DatesTable[[#This Row],[Start Date]],0)","v":"2023-06-30"},null,"Canada Day","2023-07-01"]
["Jul-1-2023 - Jul-31-2023",{"$f":"+C5+1","v":"2023-07-01"},{"$f":"EOMONTH(DatesTable[[#This Row],[Start Date]],0)","v":"2023-07-31"},null,"Canada Day in lieu","2023-01-03"]
["Aug-1-2023 - Aug-31-2023",{"$f":"+C6+1","v":"2023-08-01"},{"$f":"EOMONTH(DatesTable[[#This Row],[Start Date]],0)","v":"2023-08-31"},null,"BC Day","2023-08-07"]
["Sep-1-2023 - Sep-30-2023","2023-09-01",{"$f":"EOMONTH(DatesTable[[#This Row],[Start Date]],0)","v":"2023-09-30"},null,"Labour Day","2023-09-04"]
["Oct-1-2023 - Oct-31-2023","2023-10-01",{"$f":"EOMONTH(DatesTable[[#This Row],[Start Date]],0)","v":"2023-10-31"},null,"National Day for Truth and Reconciliation","2023-09-30"]
["Nov-1-2023 - Nov-30-2023","2023-11-01",{"$f":"EOMONTH(DatesTable[[#This Row],[Start Date]],0)","v":"2023-11-30"},null,"National Day for Truth and Reconciliation in Lieu","2023-10-03"]
{"$rows_left_out":7}